Target
Oxytocin receptor
Ligand
BDBM50263912
Substrate
Meas. Tech.
ChEMBL_535596 (CHEMBL987070)
Ki
144±n/a nM
Citation
 Brown, ABrown, LBrown, TBCalabrese, AEllis, DPuhalo, NSmith, CRWallace, OWatson, L Triazole oxytocin antagonists: identification of aryl ether replacements for a biaryl substituent. Bioorg Med Chem Lett 18:5242-4 (2008)  
Target
Name:
Oxytocin receptor
Synonyms:
OT-R OXYR_HUMAN | Oxytocin
Type:
Enzyme Catalytic Domain
Mol. Mass.:
42793.26
Organism:
Homo sapiens (Human)
Description:
Oxytocin OXTR HEK293::B2R9L7
Residue:
389
  
Inhibitor
Name:
BDBM50263912
Synonyms:
5-(3-(3-chloro-4-ethoxyphenyl)-5-(methoxymethyl)-4H-1,2,4-triazol-4-yl)-2-methoxypyridine | CHEMBL489386
Type:
Small organic molecule
Emp. Form.:
C18H19ClN4O3
Mol. Mass.:
374.821
SMILES:
CCOc1ccc(cc1Cl)-c1nnc(COC)n1-c1ccc(OC)nc1
: