Target
Oxytocin receptor
Ligand
BDBM50263914
Substrate
Meas. Tech.
ChEMBL_535596 (CHEMBL987070)
Ki
19±n/a nM
Citation
 Brown, ABrown, LBrown, TBCalabrese, AEllis, DPuhalo, NSmith, CRWallace, OWatson, L Triazole oxytocin antagonists: identification of aryl ether replacements for a biaryl substituent. Bioorg Med Chem Lett 18:5242-4 (2008)  
Target
Name:
Oxytocin receptor
Synonyms:
OT-R OXYR_HUMAN | Oxytocin
Type:
Enzyme Catalytic Domain
Mol. Mass.:
42793.26
Organism:
Homo sapiens (Human)
Description:
Oxytocin OXTR HEK293::B2R9L7
Residue:
389
  
Inhibitor
Name:
BDBM50263914
Synonyms:
5-(3-(4-ethoxy-3-methylphenyl)-5-((2-methoxyethoxy)methyl)-4H-1,2,4-triazol-4-yl)-2-methoxypyridine | CHEMBL522255
Type:
Small organic molecule
Emp. Form.:
C21H26N4O4
Mol. Mass.:
398.4555
SMILES:
CCOc1ccc(cc1C)-c1nnc(COCCOC)n1-c1ccc(OC)nc1
: