Target
Vasopressin V2 receptor
Ligand
BDBM50263856
Substrate
Meas. Tech.
ChEMBL_535599 (CHEMBL987073)
Ki
>10000±n/a nM
Citation
 Brown, ABrown, LBrown, TBCalabrese, AEllis, DPuhalo, NSmith, CRWallace, OWatson, L Triazole oxytocin antagonists: identification of aryl ether replacements for a biaryl substituent. Bioorg Med Chem Lett 18:5242-4 (2008)  
Target
Name:
Vasopressin V2 receptor
Synonyms:
ADHR AVPR2 DIR Renal-type arginine vasopressin receptor V2R_HUMAN Vasopressin V2 receptor | Vasopressin receptor
Type:
Receptor
Mol. Mass.:
40295.28
Organism:
Homo sapiens (Human)
Description:
P30518
Residue:
371
  
Inhibitor
Name:
BDBM50263856
Synonyms:
5-(3-(4-ethoxy-3-methylphenyl)-5-(ethoxymethyl)-4H-1,2,4-triazol-4-yl)-2-methoxypyridine | CHEMBL492029
Type:
Small organic molecule
Emp. Form.:
C20H24N4O3
Mol. Mass.:
368.4296
SMILES:
CCOCc1nnc(-c2ccc(OCC)c(C)c2)n1-c1ccc(OC)nc1
: