Target
Cholinesterase
Ligand
BDBM50265191
Substrate
Meas. Tech.
ChEMBL_497075 (CHEMBL997711)
Ki
252±n/a nM
Citation
 Butini, SGuarino, ECampiani, GBrindisi, MCoccone, SSFiorini, INovellino, EBelinskaya, TSaxena, AGemma, S Tacrine based human cholinesterase inhibitors: synthesis of peptidic-tethered derivatives and their effect on potency and selectivity. Bioorg Med Chem Lett 18:5213-6 (2008)  
Target
Name:
Cholinesterase
Synonyms:
Acylcholine acylhydrolase Butyrylcholine esterase (BChE) Butyrylcholinesterase (BuChE) CHLE_HUMAN Cholinesterases Pseudocholinesterase
Type:
Homotetramer
Mol. Mass.:
68422.27
Organism:
Homo sapiens (Human)
Description:
P06276
Residue:
602
  
Inhibitor
Name:
BDBM50265191
Synonyms:
(S)-2-amino-3-(naphthalen-2-yl)-N-(2-oxo-2-(1,2,3,4-tetrahydroacridin-9-ylamino)ethyl)propanamide | CHEMBL496946
Type:
Small organic molecule
Emp. Form.:
C28H28N4O2
Mol. Mass.:
452.5475
SMILES:
N[C@@H](Cc1ccc2ccccc2c1)C(=O)NCC(=O)Nc1c2CCCCc2nc2ccccc12
: