Target
Acetylcholinesterase
Ligand
BDBM50265250
Substrate
Meas. Tech.
ChEMBL_497074 (CHEMBL997710)
Ki
7970±n/a nM
Citation
 Butini, SGuarino, ECampiani, GBrindisi, MCoccone, SSFiorini, INovellino, EBelinskaya, TSaxena, AGemma, S Tacrine based human cholinesterase inhibitors: synthesis of peptidic-tethered derivatives and their effect on potency and selectivity. Bioorg Med Chem Lett 18:5213-6 (2008)  
Target
Name:
Acetylcholinesterase
Synonyms:
ACES_HUMAN Acetylcholinesterase (AChE) | Acetylcholinesterase (human AChE)
Type:
Enzyme
Mol. Mass.:
67792.70
Organism:
Homo sapiens (Human)
Description:
P22303
Residue:
614
  
Inhibitor
Name:
BDBM50265250
Synonyms:
(S)-tert-butyl 3-(1H-indol-3-yl)-1-oxo-1-(3-oxo-3-(1,2,3,4-tetrahydroacridin-9-ylamino)propylamino)propan-2-ylcarbamate | CHEMBL508778
Type:
Small organic molecule
Emp. Form.:
C32H37N5O4
Mol. Mass.:
555.6673
SMILES:
CC(C)(C)OC(=O)N[C@@H](Cc1c[nH]c2ccccc12)C(=O)NCCC(=O)Nc1c2CCCCc2nc2ccccc12
: