Target
Cholinesterase
Ligand
BDBM50265251
Substrate
Meas. Tech.
ChEMBL_497075 (CHEMBL997711)
Ki
173±n/a nM
Citation
 Butini, SGuarino, ECampiani, GBrindisi, MCoccone, SSFiorini, INovellino, EBelinskaya, TSaxena, AGemma, S Tacrine based human cholinesterase inhibitors: synthesis of peptidic-tethered derivatives and their effect on potency and selectivity. Bioorg Med Chem Lett 18:5213-6 (2008)  
Target
Name:
Cholinesterase
Synonyms:
Acylcholine acylhydrolase Butyrylcholine esterase (BChE) Butyrylcholinesterase (BuChE) CHLE_HUMAN Cholinesterases Pseudocholinesterase
Type:
Homotetramer
Mol. Mass.:
68422.27
Organism:
Homo sapiens (Human)
Description:
P06276
Residue:
602
  
Inhibitor
Name:
BDBM50265251
Synonyms:
(S)-2-amino-3-(1H-indol-3-yl)-N-(3-oxo-3-(1,2,3,4-tetrahydroacridin-9-ylamino)propyl)propanamide | CHEMBL496127
Type:
Small organic molecule
Emp. Form.:
C27H29N5O2
Mol. Mass.:
455.5515
SMILES:
N[C@@H](Cc1c[nH]c2ccccc12)C(=O)NCCC(=O)Nc1c2CCCCc2nc2ccccc12
: