Target
Cholinesterase
Ligand
BDBM50265254
Substrate
Meas. Tech.
ChEMBL_497075 (CHEMBL997711)
Ki
12.63±n/a nM
Citation
 Butini, SGuarino, ECampiani, GBrindisi, MCoccone, SSFiorini, INovellino, EBelinskaya, TSaxena, AGemma, S Tacrine based human cholinesterase inhibitors: synthesis of peptidic-tethered derivatives and their effect on potency and selectivity. Bioorg Med Chem Lett 18:5213-6 (2008)  
Target
Name:
Cholinesterase
Synonyms:
Acylcholine acylhydrolase Butyrylcholine esterase (BChE) Butyrylcholinesterase (BuChE) CHLE_HUMAN Cholinesterases Pseudocholinesterase
Type:
Homotetramer
Mol. Mass.:
68422.27
Organism:
Homo sapiens (Human)
Description:
P06276
Residue:
602
  
Inhibitor
Name:
BDBM50265254
Synonyms:
(S)-tert-butyl 1,5-dioxo-1,5-bis(2-(1,2,3,4-tetrahydroacridin-9-ylamino)ethylamino)pentan-2-ylcarbamate | CHEMBL504571
Type:
Small organic molecule
Emp. Form.:
C40H51N7O4
Mol. Mass.:
693.8774
SMILES:
CC(C)(C)OC(=O)N[C@@H](CCC(=O)NCCNc1c2CCCCc2nc2ccccc12)C(=O)NCCNc1c2CCCCc2nc2ccccc12
: