Target
Cytochrome P450 3A4
Ligand
BDBM50263614
Substrate
Meas. Tech.
ChEMBL_535882 (CHEMBL995002)
IC50
12000±n/a nM
Citation
 Trani, GBaddeley, SMBriggs, MAChuang, TTDeeks, NJJohnson, CNKhazragi, AAMead, TLMedhurst, ADMilner, PHQuinn, LPRay, AMRivers, DAStean, TOStemp, GTrail, BKWitty, DR Tricyclic azepine derivatives as selective brain penetrant 5-HT6 receptor antagonists. Bioorg Med Chem Lett 18:5698-700 (2008)  
Target
Name:
Cytochrome P450 3A4
Synonyms:
Albendazole monooxygenase CP3A4_HUMAN CYP3A4 CYPIIIA4 Cytochrome P450 3A4 (CYP3A4) Nifedipine oxidase Taurochenodeoxycholate 6-alpha-hydroxylase
Type:
Enzyme
Mol. Mass.:
57349.57
Organism:
Homo sapiens (Human)
Description:
Residue:
503
  
Inhibitor
Name:
BDBM50263614
Synonyms:
3-chloro-1-(phenylsulfonyl)-1,5,6,7,8,9-hexahydroazepino[4,5-f]indole | CHEMBL515624
Type:
Small organic molecule
Emp. Form.:
C18H17ClN2O2S
Mol. Mass.:
360.858
SMILES:
Clc1cn(c2cc3CCNCCc3cc12)S(=O)(=O)c1ccccc1
: