Target
Cytochrome P450 3A4
Ligand
BDBM50263518
Substrate
Meas. Tech.
ChEMBL_536049 (CHEMBL991619)
IC50
20000±n/a nM
Citation
 Trani, GBaddeley, SMBriggs, MAChuang, TTDeeks, NJJohnson, CNKhazragi, AAMead, TLMedhurst, ADMilner, PHQuinn, LPRay, AMRivers, DAStean, TOStemp, GTrail, BKWitty, DR Tricyclic azepine derivatives as selective brain penetrant 5-HT6 receptor antagonists. Bioorg Med Chem Lett 18:5698-700 (2008)  
Target
Name:
Cytochrome P450 3A4
Synonyms:
Albendazole monooxygenase CP3A4_HUMAN CYP3A4 CYPIIIA4 Cytochrome P450 3A4 (CYP3A4) Nifedipine oxidase Taurochenodeoxycholate 6-alpha-hydroxylase
Type:
Enzyme
Mol. Mass.:
57349.57
Organism:
Homo sapiens (Human)
Description:
Residue:
503
  
Inhibitor
Name:
BDBM50263518
Synonyms:
1-(phenylsulfonyl)-1,5,6,7,8,9-hexahydroazepino[4,5-f]indole | CHEMBL517828
Type:
Small organic molecule
Emp. Form.:
C18H18N2O2S
Mol. Mass.:
326.413
SMILES:
O=S(=O)(c1ccccc1)n1ccc2cc3CCNCCc3cc12
: