Target
Cytochrome P450 3A4
Ligand
BDBM50263616
Substrate
Meas. Tech.
ChEMBL_536049 (CHEMBL991619)
IC50
71000±n/a nM
Citation
 Trani, GBaddeley, SMBriggs, MAChuang, TTDeeks, NJJohnson, CNKhazragi, AAMead, TLMedhurst, ADMilner, PHQuinn, LPRay, AMRivers, DAStean, TOStemp, GTrail, BKWitty, DR Tricyclic azepine derivatives as selective brain penetrant 5-HT6 receptor antagonists. Bioorg Med Chem Lett 18:5698-700 (2008)  
Target
Name:
Cytochrome P450 3A4
Synonyms:
Albendazole monooxygenase CP3A4_HUMAN CYP3A4 CYPIIIA4 Cytochrome P450 3A4 (CYP3A4) Nifedipine oxidase Taurochenodeoxycholate 6-alpha-hydroxylase
Type:
Enzyme
Mol. Mass.:
57349.57
Organism:
Homo sapiens (Human)
Description:
Residue:
503
  
Inhibitor
Name:
BDBM50263616
Synonyms:
1-(3-chlorophenylsulfonyl)-7-methyl-1,5,6,7,8,9-hexahydroazepino[4,5-f]indole | CHEMBL518591
Type:
Small organic molecule
Emp. Form.:
C19H19ClN2O2S
Mol. Mass.:
374.884
SMILES:
CN1CCc2cc3ccn(c3cc2CC1)S(=O)(=O)c1cccc(Cl)c1
: