Target
Alpha-2C adrenergic receptor
Ligand
BDBM50263672
Substrate
Meas. Tech.
ChEMBL_535909 (CHEMBL983550)
Ki
4.8±n/a nM
Citation
 Patel, SDHabeski, WMMin, HZhang, JRoof, RSnyder, BBora, GCampbell, BLi, CHidayetoglu, DJohnson, DSChaudhry, ACharlton, MEKablaoui, NM Identification and SAR around N-{2-[4-(2,3-dihydro-benzo[1,4]dioxin-2-ylmethyl)-[1,4]diazepan-1-yl]-ethyl}-2-phenoxy-nicotinamide, a selective alpha2C adrenergic receptor antagonist. Bioorg Med Chem Lett 18:5689-93 (2008)  
Target
Name:
Alpha-2C adrenergic receptor
Synonyms:
ADA2C_HUMAN ADRA2L2 Adrenergic alpha2C Adrenergic receptor alpha Alpha-2 adrenergic receptor subtype C4 Alpha-2C adrenoreceptor | adrenergic, alpha-2C-, receptor [Homo sapiens]
Type:
Enzyme
Mol. Mass.:
49552.32
Organism:
Homo sapiens (Human)
Description:
P18825
Residue:
462
  
Inhibitor
Name:
BDBM50263672
Synonyms:
2-butoxy-N-(2-(4-((2,3-dihydrobenzo[b][1,4]dioxin-2-yl)methyl)-1,4-diazepan-1-yl)ethyl)nicotinamide | CHEMBL514837
Type:
Small organic molecule
Emp. Form.:
C26H36N4O4
Mol. Mass.:
468.5884
SMILES:
CCCCOc1ncccc1C(=O)NCCN1CCCN(CC2COc3ccccc3O2)CC1
: