Target
Cyclin-dependent kinase 4
Ligand
BDBM50263028
Substrate
Meas. Tech.
ChEMBL_536408 (CHEMBL992479)
IC50
200±n/a nM
Citation
 Anderson, MAndrews, DMBarker, AJBrassington, CABreed, JByth, KFCulshaw, JDFinlay, MRFisher, EMcMiken, HHGreen, CPHeaton, DWNash, IANewcombe, NJOakes, SEPauptit, RARoberts, AStanway, JJThomas, APTucker, JAWalker, MWeir, HM Imidazoles: SAR and development of a potent class of cyclin-dependent kinase inhibitors. Bioorg Med Chem Lett 18:5487-92 (2008)  
Target
Name:
Cyclin-dependent kinase 4
Synonyms:
CDK4 Cell division protein kinase 4 PSK-J3
Type:
Enzyme Subunit
Mol. Mass.:
33731.96
Organism:
Homo sapiens (Human)
Description:
P11802
Residue:
303
  
Inhibitor
Name:
BDBM50263028
Synonyms:
4-(4-(1-isopropyl-2-methyl-1H-imidazol-5-yl)pyrimidin-2-ylamino)-N-(2-methoxyethyl)benzenesulfonamide N-(2-METHOXYETHYL)-4-({4-[2-METHYL-1-(1-METHYLETHYL)-1H-IMIDAZOL-5-YL]PYRIMIDIN-2-YL}AMINO)BENZENESULFONAMIDE
Type:
Small organic molecule
Emp. Form.:
C20H26N6O3S
Mol. Mass.:
430.524
SMILES:
COCCNS(=O)(=O)c1ccc(Nc2nccc(n2)-c2cnc(C)n2C(C)C)cc1
: