Target
Sigma non-opioid intracellular receptor 1
Ligand
BDBM81982
Substrate
Meas. Tech.
ChEMBL_539504 (CHEMBL1032313)
Ki
61±n/a nM
Citation
 Oberdorf, CSchepmann, DVela, JMDiaz, JLHolenz, JWünsch, B Thiophene bioisosteres of spirocyclic sigma receptor ligands. 1. N-substituted spiro[piperidine-4,4'-thieno[3,2-c]pyrans]. J Med Chem 51:6531-7 (2008)  
Target
Name:
Sigma non-opioid intracellular receptor 1
Synonyms:
OPRS1 SIGMAR1 Sigma non-opioid intracellular receptor 1 Sigma1-receptor Sterol isomerase-like protein
Type:
Protein
Mol. Mass.:
25307.17
Organism:
Cavia porcellus (Guinea pig)
Description:
Q60492
Residue:
223
  
Inhibitor
Name:
BDBM81982
Synonyms:
CAS_97-39-2 DTG Tol2Gdn | cid_7333
Type:
Small organic molecule
Emp. Form.:
C15H17N3
Mol. Mass.:
239.3156
SMILES:
Cc1ccccc1NC(N)=Nc1ccccc1C
: