Target
Cholinesterase
Ligand
BDBM50252742
Substrate
Meas. Tech.
ChEMBL_534768 (CHEMBL986292)
IC50
4100±n/a nM
Citation
 Carolan, CGDillon, GPGaynor, JMReidy, SRyder, SAKhan, DMarquez, JFGilmer, JF Isosorbide-2-carbamate esters: potent and selective butyrylcholinesterase inhibitors. J Med Chem 51:6400-9 (2008)  
Target
Name:
Cholinesterase
Synonyms:
Acylcholine acylhydrolase Butyrylcholine esterase (BChE) Butyrylcholinesterase (BuChE) CHLE_HUMAN Cholinesterases Pseudocholinesterase
Type:
Homotetramer
Mol. Mass.:
68422.27
Organism:
Homo sapiens (Human)
Description:
P06276
Residue:
602
  
Inhibitor
Name:
BDBM50252742
Synonyms:
CHEMBL493460 | Isosorbide-2-benzylcarbamate-5-acetate
Type:
Small organic molecule
Emp. Form.:
C16H19NO6
Mol. Mass.:
321.3252
SMILES:
CC(=O)O[C@@H]1CO[C@@H]2[C@H](CO[C@H]12)OC(=O)NCc1ccccc1
: