Target
Cholinesterase
Ligand
BDBM50253227
Substrate
Meas. Tech.
ChEMBL_534768 (CHEMBL986292)
IC50
894±n/a nM
Citation
 Carolan, CGDillon, GPGaynor, JMReidy, SRyder, SAKhan, DMarquez, JFGilmer, JF Isosorbide-2-carbamate esters: potent and selective butyrylcholinesterase inhibitors. J Med Chem 51:6400-9 (2008)  
Target
Name:
Cholinesterase
Synonyms:
Acylcholine acylhydrolase Butyrylcholine esterase (BChE) Butyrylcholinesterase (BuChE) CHLE_HUMAN Cholinesterases Pseudocholinesterase
Type:
Homotetramer
Mol. Mass.:
68422.27
Organism:
Homo sapiens (Human)
Description:
P06276
Residue:
602
  
Inhibitor
Name:
BDBM50253227
Synonyms:
CHEMBL494520 | Isosorbide-2-(butylcarbamate)-5-mononitrate
Type:
Small organic molecule
Emp. Form.:
C11H18N2O7
Mol. Mass.:
290.2698
SMILES:
CCCCNC(=O)O[C@H]1CO[C@@H]2[C@@H](CO[C@H]12)O[N+]([O-])=O
: