Target
Cholinesterase
Ligand
BDBM50252745
Substrate
Meas. Tech.
ChEMBL_534768 (CHEMBL986292)
IC50
73±n/a nM
Citation
 Carolan, CGDillon, GPGaynor, JMReidy, SRyder, SAKhan, DMarquez, JFGilmer, JF Isosorbide-2-carbamate esters: potent and selective butyrylcholinesterase inhibitors. J Med Chem 51:6400-9 (2008)  
Target
Name:
Cholinesterase
Synonyms:
Acylcholine acylhydrolase Butyrylcholine esterase (BChE) Butyrylcholinesterase (BuChE) CHLE_HUMAN Cholinesterases Pseudocholinesterase
Type:
Homotetramer
Mol. Mass.:
68422.27
Organism:
Homo sapiens (Human)
Description:
P06276
Residue:
602
  
Inhibitor
Name:
BDBM50252745
Synonyms:
2-(Benzylaminocarbonyloxy-) 5-(coumarincarbonyloxy-)-1,4:3,6-dianhydro-D-glucitol | CHEMBL521810
Type:
Small organic molecule
Emp. Form.:
C23H23NO7
Mol. Mass.:
425.4312
SMILES:
Oc1ccc(C=CC(=O)O[C@@H]2CO[C@@H]3[C@H](CO[C@H]23)OC(=O)NCc2ccccc2)cc1
: