Target
Cholinesterase
Ligand
BDBM50252743
Substrate
Meas. Tech.
ChEMBL_534768 (CHEMBL986292)
IC50
137±n/a nM
Citation
 Carolan, CGDillon, GPGaynor, JMReidy, SRyder, SAKhan, DMarquez, JFGilmer, JF Isosorbide-2-carbamate esters: potent and selective butyrylcholinesterase inhibitors. J Med Chem 51:6400-9 (2008)  
Target
Name:
Cholinesterase
Synonyms:
Acylcholine acylhydrolase Butyrylcholine esterase (BChE) Butyrylcholinesterase (BuChE) CHLE_HUMAN Cholinesterases Pseudocholinesterase
Type:
Homotetramer
Mol. Mass.:
68422.27
Organism:
Homo sapiens (Human)
Description:
P06276
Residue:
602
  
Inhibitor
Name:
BDBM50252743
Synonyms:
2-(Benzylaminocarbonyloxy-) 5-O-cinnamoyl-1,4:3,6-dianhydro-D-glucitol | CHEMBL492233
Type:
Small organic molecule
Emp. Form.:
C23H23NO6
Mol. Mass.:
409.4318
SMILES:
O=C(NCc1ccccc1)O[C@H]1CO[C@@H]2[C@@H](CO[C@H]12)OC(=O)C=Cc1ccccc1
: