Target
Acetylcholinesterase
Ligand
BDBM50252786
Substrate
Meas. Tech.
ChEMBL_534770 (CHEMBL986294)
IC50
56300±n/a nM
Citation
 Carolan, CGDillon, GPGaynor, JMReidy, SRyder, SAKhan, DMarquez, JFGilmer, JF Isosorbide-2-carbamate esters: potent and selective butyrylcholinesterase inhibitors. J Med Chem 51:6400-9 (2008)  
Target
Name:
Acetylcholinesterase
Synonyms:
ACES_ELEEL Acetylcholinesterase (EeAChE) | ache
Type:
Enzyme
Mol. Mass.:
71812.79
Organism:
Electrophorus electricus (Electric eel)
Description:
Residue:
633
  
Inhibitor
Name:
BDBM50252786
Synonyms:
CHEMBL492635 | Isosorbide-2-benzylcarbamate-5-cyclopentanoate
Type:
Small organic molecule
Emp. Form.:
C20H25NO6
Mol. Mass.:
375.4156
SMILES:
O=C(NCc1ccccc1)O[C@H]1CO[C@@H]2[C@@H](CO[C@H]12)OC(=O)C1CCCC1
: