Target
Small conductance calcium-activated potassium channel protein 3
Ligand
BDBM50275959
Substrate
Meas. Tech.
ChEMBL_497517 (CHEMBL995892)
IC50
7500±n/a nM
Citation
 Gentles, RGHu, SHuang, YGrant-Young, KPoss, MAAndres, CFiedler, TKnox, RLodge, NWeaver, CDHarden, DG Preliminary SAR studies on non-apamin-displacing 4-(aminomethylaryl)pyrrazolopyrimidine K(Ca) channel blockers. Bioorg Med Chem Lett 18:5694-7 (2008)  
Target
Name:
Small conductance calcium-activated potassium channel protein 3
Synonyms:
K3 KCNN3_HUMAN Small conductance calcium-activated potassium channel protein 3 (KCa2.3)
Type:
Protein
Mol. Mass.:
82053.75
Organism:
Homo sapiens (Human)
Description:
Q9UGI6
Residue:
731
  
Inhibitor
Name:
BDBM50275959
Synonyms:
5-chloro-N-(1,2-diphenylethyl)pyrazolo[1,5-a]pyrimidin-7-amine | CHEMBL513544
Type:
Small organic molecule
Emp. Form.:
C20H17ClN4
Mol. Mass.:
348.829
SMILES:
Clc1cc(NC(Cc2ccccc2)c2ccccc2)n2nccc2n1
: