Target
Small conductance calcium-activated potassium channel protein 3
Ligand
BDBM50275798
Substrate
Meas. Tech.
ChEMBL_497517 (CHEMBL995892)
IC50
5200±n/a nM
Citation
 Gentles, RGHu, SHuang, YGrant-Young, KPoss, MAAndres, CFiedler, TKnox, RLodge, NWeaver, CDHarden, DG Preliminary SAR studies on non-apamin-displacing 4-(aminomethylaryl)pyrrazolopyrimidine K(Ca) channel blockers. Bioorg Med Chem Lett 18:5694-7 (2008)  
Target
Name:
Small conductance calcium-activated potassium channel protein 3
Synonyms:
K3 KCNN3_HUMAN Small conductance calcium-activated potassium channel protein 3 (KCa2.3)
Type:
Protein
Mol. Mass.:
82053.75
Organism:
Homo sapiens (Human)
Description:
Q9UGI6
Residue:
731
  
Inhibitor
Name:
BDBM50275798
Synonyms:
5-chloro-N-(3-chlorobenzyl)pyrazolo[1,5-a]pyrimidin-7-amine | CHEMBL469756
Type:
Small organic molecule
Emp. Form.:
C13H10Cl2N4
Mol. Mass.:
293.151
SMILES:
Clc1cccc(CNc2cc(Cl)nc3ccnn23)c1
: