Target
Potassium voltage-gated channel subfamily H member 2
Ligand
BDBM50275984
Substrate
Meas. Tech.
ChEMBL_493154 (CHEMBL944326)
EC50
10300±n/a nM
Citation
 Methot, JLHamblett, CLMampreian, DMJung, JHarsch, ASzewczak, AADahlberg, WKMiddleton, REHughes, BFleming, JCWang, HKral, AMOzerova, NCruz, JCHaines, BChenard, MKenific, CMSecrist, JPMiller, TA SAR profiles of spirocyclic nicotinamide derived selective HDAC1/HDAC2 inhibitors (SHI-1:2). Bioorg Med Chem Lett 18:6104-9 (2008)  
Target
Name:
Potassium voltage-gated channel subfamily H member 2
Synonyms:
1,3-beta-glucan synthase component GLS2 ERG Eag-related protein 1 Ether-a-go-go-related gene (HERG) Ether-a-go-go-related gene potassium channel 1 Ether-a-go-go-related gene potassium channel 1 (hERG1) Ether-a-go-go-related protein 1 H-ERG KCNH2 Potassium voltage-gated channel subfamily H member 2 (hERG) Voltage-gated potassium channel subunit Kv11.1 hERG Potassium Channel 1 | putative potassium channel subunit
Type:
Multi-pass membrane protein
Mol. Mass.:
126672.65
Organism:
Homo sapiens (Human)
Description:
Q12809
Residue:
1159
  
Inhibitor
Name:
BDBM50275984
Synonyms:
6-(7-acetyl-2,7-diazaspiro[4.4]nonan-2-yl)-N-(2-amino-5-(thiophen-2-yl)phenyl)nicotinamide | CHEMBL472442
Type:
Small organic molecule
Emp. Form.:
C25H27N5O2S
Mol. Mass.:
461.579
SMILES:
CC(=O)N1CCC2(CCN(C2)c2ccc(cn2)C(=O)Nc2cc(ccc2N)-c2cccs2)C1
: