Target
Amine oxidase [flavin-containing] A
Ligand
BDBM50273590
Substrate
Meas. Tech.
ChEMBL_536001 (CHEMBL988017)
Ki
10±n/a nM
Citation
 La Regina, GSilvestri, RGatti, VLavecchia, ANovellino, EBefani, OTurini, PAgostinelli, E Synthesis, structure-activity relationships and molecular modeling studies of new indole inhibitors of monoamine oxidases A and B. Bioorg Med Chem 16:9729-40 (2008)  
Target
Name:
Amine oxidase [flavin-containing] A
Synonyms:
AOFA_BOVIN MAO-A Monoamine Oxidase Type A (MAO-A) Monoamine oxidase A | Monoamine oxidase type A
Type:
PROTEIN
Mol. Mass.:
59764.63
Organism:
Bos taurus
Description:
ChEMBL_1501477
Residue:
527
  
Inhibitor
Name:
BDBM50273590
Synonyms:
CHEMBL449889 | N-(1-Methyl-1H-indol-2-ylmethyl)-N-phenylamine
Type:
Small organic molecule
Emp. Form.:
C16H16N2
Mol. Mass.:
236.3116
SMILES:
Cn1c(CNc2ccccc2)cc2ccccc12
: