Target
Leukotriene A-4 hydrolase
Ligand
BDBM50085290
Substrate
Meas. Tech.
ChEMBL_558389 (CHEMBL963111)
IC50
9±n/a nM
Citation
 Jiang, XZhou, LWei, DMeng, HLiu, YLai, L Activation and inhibition of leukotriene A4 hydrolase aminopeptidase activity by diphenyl ether and derivatives. Bioorg Med Chem Lett 18:6549-52 (2008)  
Target
Name:
Leukotriene A-4 hydrolase
Synonyms:
LKHA4_HUMAN LTA4 Leukotriene A(4) hydrolase Leukotriene A4 hydrolase
Type:
Hydrolase; metalloprotease
Mol. Mass.:
69280.41
Organism:
Homo sapiens (Human)
Description:
Human recombinant LTA4H.
Residue:
611
  
Inhibitor
Name:
BDBM50085290
Synonyms:
2-(4-Benzyl-phenoxy)-ethylamine CHEMBL163807
Type:
Small organic molecule
Emp. Form.:
C15H17NO
Mol. Mass.:
227.3016
SMILES:
NCCOc1ccc(Cc2ccccc2)cc1
: