Target
Leukotriene A-4 hydrolase
Ligand
BDBM50246011
Substrate
Meas. Tech.
ChEMBL_558390 (CHEMBL963112)
IC50
5560±n/a nM
Citation
 Jiang, XZhou, LWei, DMeng, HLiu, YLai, L Activation and inhibition of leukotriene A4 hydrolase aminopeptidase activity by diphenyl ether and derivatives. Bioorg Med Chem Lett 18:6549-52 (2008)  
Target
Name:
Leukotriene A-4 hydrolase
Synonyms:
LKHA4_HUMAN LTA4 Leukotriene A(4) hydrolase Leukotriene A4 hydrolase
Type:
Hydrolase; metalloprotease
Mol. Mass.:
69280.41
Organism:
Homo sapiens (Human)
Description:
Human recombinant LTA4H.
Residue:
611
  
Inhibitor
Name:
BDBM50246011
Synonyms:
4-(4-butoxyphenoxy)phenol | CHEMBL467374
Type:
Small organic molecule
Emp. Form.:
C16H18O3
Mol. Mass.:
258.3123
SMILES:
CCCCOc1ccc(Oc2ccc(O)cc2)cc1
: