Target
Cytochrome P450 2D6
Ligand
BDBM50022784
Substrate
Meas. Tech.
ChEMBL_558436 (CHEMBL963842)
IC50
2000±n/a nM
Citation
 Pontillo, JWu, DChing, BHudson, SGenicot, MJGao, YEwing, TFleck, BAGogas, KAparicio, AWang, HWen, JWade, WS Synthesis and structure-activity relationships of selective norepinephrine reuptake inhibitors (sNRI) with improved pharmaceutical characteristics. Bioorg Med Chem Lett 18:6151-5 (2008)  
Target
Name:
Cytochrome P450 2D6
Synonyms:
CP2D6_HUMAN CYP2DL1 Cytochrome P450 2D6 (CYP2D6) P450-DB1
Type:
Protein
Mol. Mass.:
55774.82
Organism:
Homo sapiens (Human)
Description:
P10635
Residue:
497
  
Inhibitor
Name:
BDBM50022784
Synonyms:
(R)-N-methyl-3-phenyl-3-(o-tolyloxy)propan-1-amine CHEMBL641 Methyl-(3-phenyl-3-o-tolyloxy-propyl)-amine Strattera | Tomoxetine
Type:
Small organic molecule
Emp. Form.:
C17H21NO
Mol. Mass.:
255.3547
SMILES:
CNCCC(Oc1ccccc1C)c1ccccc1
: