Target
Cytochrome P450 2C19
Ligand
BDBM50275377
Substrate
Meas. Tech.
ChEMBL_493397 (CHEMBL943378)
EC50
>50000±n/a nM
Citation
 Payne, JEBonnefous, CHassig, CASymons, KTGuo, XNguyen, PMAnnable, TWash, PLHoffman, TZRao, TSShiau, AKMalecha, JWNoble, SAHager, JHSmith, ND Identification of KD5170: a novel mercaptoketone-based histone deacetylase inhibitor. Bioorg Med Chem Lett 18:6093-6 (2008)  
Target
Name:
Cytochrome P450 2C19
Synonyms:
(R)-limonene 6-monooxygenase (S)-limonene 7-monooxygenase CYP2C19 CYPIIC19 Cytochrome P450 2C19 [I331V] Cytochrome P450-254C Mephenytoin 4-hydroxylase P450-254C
Type:
Enzyme
Mol. Mass.:
55935.47
Organism:
Homo sapiens (Human)
Description:
P33261
Residue:
490
  
Inhibitor
Name:
BDBM50275377
Synonyms:
CHEMBL520237 | S-2-(6-(4-(3-(dimethylamino)propoxy)phenylsulfonamido)pyridin-3-yl)-2-oxoethyl ethanethioate hydrobromide
Type:
Small organic molecule
Emp. Form.:
C20H25N3O5S2
Mol. Mass.:
451.56
SMILES:
CN(C)CCCOc1ccc(cc1)S(=O)(=O)Nc1ccc(cn1)C(=O)CSC(C)=O
: