Target
Hydroxycarboxylic acid receptor 3
Ligand
BDBM50208138
Substrate
Meas. Tech.
ChEMBL_536824 (CHEMBL988088)
IC50
3000±n/a nM
Citation
 Boatman, PDRichman, JGSemple, G Nicotinic acid receptor agonists. J Med Chem 51:7653-62 (2008)  
Target
Name:
Hydroxycarboxylic acid receptor 3
Synonyms:
G-protein coupled receptor 109B G-protein coupled receptor HM74B HCA3 HCAR3_HUMAN HM74B NIACR2 Nicotinic acid receptor 2
Type:
Enzyme Catalytic Domain
Mol. Mass.:
44498.06
Organism:
Homo sapiens (Human)
Description:
GPR109B 0 HUMAN::P49019
Residue:
387
  
Inhibitor
Name:
BDBM50208138
Synonyms:
(+)-acifran 5-Methyl-4-oxo-5-phenyl-4,5-dihydro-furan-2-carboxylic acid CHEMBL278488 | acifran
Type:
Small organic molecule
Emp. Form.:
C12H10O4
Mol. Mass.:
218.2054
SMILES:
CC1(OC(=CC1=O)C(O)=O)c1ccccc1
: