Target
Polyphenol oxidase 2
Ligand
BDBM50245832
Substrate
Meas. Tech.
ChEMBL_559710 (CHEMBL1012868)
IC50
>3000000±n/a nM
Citation
 Yi, WCao, RWen, HYan, QZhou, BWan, YMa, LSong, H Synthesis and biological evaluation of helicid analogues as mushroom tyrosinase inhibitors. Bioorg Med Chem Lett 18:6490-3 (2008)  
Target
Name:
Polyphenol oxidase 2
Synonyms:
Monophenol monooxygenase PPO2 Tyrosinase
Type:
Protein
Mol. Mass.:
63923.66
Organism:
Agaricus bisporus (Common mushroom)
Description:
O42713
Residue:
556
  
Inhibitor
Name:
BDBM50245832
Synonyms:
4-((2S,3R,4R,5S,6R)-3,4,5-trihydroxy-6-(trityloxymethyl)-tetrahydro-2H-pyran-2-yloxy)benzaldehyde | CHEMBL455397
Type:
Small organic molecule
Emp. Form.:
C32H30O7
Mol. Mass.:
526.5764
SMILES:
O[C@@H]1[C@@H](COC(c2ccccc2)(c2ccccc2)c2ccccc2)O[C@@H](Oc2ccc(C=O)cc2)[C@H](O)[C@@H]1O
: