Target
Polyphenol oxidase 2
Ligand
BDBM50245881
Substrate
Meas. Tech.
ChEMBL_559710 (CHEMBL1012868)
IC50
620000±n/a nM
Citation
 Yi, WCao, RWen, HYan, QZhou, BWan, YMa, LSong, H Synthesis and biological evaluation of helicid analogues as mushroom tyrosinase inhibitors. Bioorg Med Chem Lett 18:6490-3 (2008)  
Target
Name:
Polyphenol oxidase 2
Synonyms:
Monophenol monooxygenase PPO2 Tyrosinase
Type:
Protein
Mol. Mass.:
63923.66
Organism:
Agaricus bisporus (Common mushroom)
Description:
O42713
Residue:
556
  
Inhibitor
Name:
BDBM50245881
Synonyms:
4-((3aR,4S,6R,7R,7aR)-7-hydroxy-6-(hydroxymethyl)-2,2-dimethyl-tetrahydro-3aH-[1,3]dioxolo[4,5-c]pyran-4-yloxy)benzaldehyde | CHEMBL460276
Type:
Small organic molecule
Emp. Form.:
C16H20O7
Mol. Mass.:
324.3258
SMILES:
CC1(C)O[C@@H]2[C@H](O1)[C@H](O)[C@@H](CO)O[C@H]2Oc1ccc(C=O)cc1
: