Target
Polyphenol oxidase 2
Ligand
BDBM50245885
Substrate
Meas. Tech.
ChEMBL_559710 (CHEMBL1012868)
IC50
>3000000±n/a nM
Citation
 Yi, WCao, RWen, HYan, QZhou, BWan, YMa, LSong, H Synthesis and biological evaluation of helicid analogues as mushroom tyrosinase inhibitors. Bioorg Med Chem Lett 18:6490-3 (2008)  
Target
Name:
Polyphenol oxidase 2
Synonyms:
Monophenol monooxygenase PPO2 Tyrosinase
Type:
Protein
Mol. Mass.:
63923.66
Organism:
Agaricus bisporus (Common mushroom)
Description:
O42713
Residue:
556
  
Inhibitor
Name:
BDBM50245885
Synonyms:
(2S,3R,4R,5R)-4,5-bis(benzoyloxy)-2-(4-formylphenoxy)oxan-3-yl benzoate CHEMBL450898
Type:
Small organic molecule
Emp. Form.:
C33H26O9
Mol. Mass.:
566.5541
SMILES:
O=Cc1ccc(O[C@@H]2OC[C@@H](OC(=O)c3ccccc3)[C@@H](OC(=O)c3ccccc3)[C@H]2OC(=O)c2ccccc2)cc1
: