Target
Polyphenol oxidase 2
Ligand
BDBM50146453
Substrate
Meas. Tech.
ChEMBL_559710 (CHEMBL1012868)
IC50
410000±n/a nM
Citation
 Yi, WCao, RWen, HYan, QZhou, BWan, YMa, LSong, H Synthesis and biological evaluation of helicid analogues as mushroom tyrosinase inhibitors. Bioorg Med Chem Lett 18:6490-3 (2008)  
Target
Name:
Polyphenol oxidase 2
Synonyms:
Monophenol monooxygenase PPO2 Tyrosinase
Type:
Protein
Mol. Mass.:
63923.66
Organism:
Agaricus bisporus (Common mushroom)
Description:
O42713
Residue:
556
  
Inhibitor
Name:
BDBM50146453
Synonyms:
(E)-3-(4-Methoxy-phenyl)-acrylic acid 4-Methoxycinnamic acid para-methoxycinnamic acid
Type:
Small organic molecule
Emp. Form.:
C10H10O3
Mol. Mass.:
178.1846
SMILES:
COc1ccc(\C=C\C(O)=O)cc1
: