Target
Adenosine receptor A3
Ligand
BDBM50245931
Substrate
Meas. Tech.
ChEMBL_559917 (CHEMBL1013711)
IC50
49±n/a nM
Citation
 Colotta, VCapelli, FLenzi, OCatarzi, DVarano, FPoli, DVincenzi, FVarani, KBorea, PADal Ben, DVolpini, RCristalli, GFilacchioni, G Novel potent and highly selective human A(3) adenosine receptor antagonists belonging to the 4-amido-2-arylpyrazolo[3,4-c]quinoline series: molecular docking analysis and pharmacological studies. Bioorg Med Chem 17:401-10 (2008)  
Target
Name:
Adenosine receptor A3
Synonyms:
A3 adenosine receptor (hA3) ADORA3 | Adenosine A3 receptor (A3AR)
Type:
G Protein-Coupled Receptor (GPCR)
Mol. Mass.:
36197.32
Organism:
Homo sapiens (Human)
Description:
P0DMS8
Residue:
318
  
Inhibitor
Name:
BDBM50245931
Synonyms:
5-methyl-N-(2-phenyl-2H-pyrazolo[3,4-c]quinolin-4-yl)furan-2-carboxamide | CHEMBL516966
Type:
Small organic molecule
Emp. Form.:
C22H16N4O2
Mol. Mass.:
368.388
SMILES:
Cc1ccc(o1)C(=O)Nc1nc2ccccc2c2cn(nc12)-c1ccccc1
: