Target
Peptide deformylase
Ligand
BDBM50255030
Substrate
Meas. Tech.
ChEMBL_559976 (CHEMBL1014575)
IC50
13±n/a nM
Citation
 Pichota, ADuraiswamy, JYin, ZKeller, THAlam, JLiung, SLee, GDing, MWang, GChan, WLSchreiber, MMa, IBeer, DNgew, XMukherjee, KNanjundappa, MTeo, JWThayalan, PYap, ADick, TMeng, WXu, MKoehn, JPan, SHClark, KXie, XShoen, CCynamon, M Peptide deformylase inhibitors of Mycobacterium tuberculosis: synthesis, structural investigations, and biological results. Bioorg Med Chem Lett 18:6568-72 (2008)  
Target
Name:
Peptide deformylase
Synonyms:
DEF_MYCTU | def
Type:
PROTEIN
Mol. Mass.:
20931.95
Organism:
Mycobacterium tuberculosis
Description:
ChEMBL_559976
Residue:
197
  
Inhibitor
Name:
BDBM50255030
Synonyms:
CHEMBL506649 N-[(2R)-2-{[(2S)-2-(1,3-benzoxazol-2-yl)pyrrolidin-1-yl]carbonyl}hexyl]-N-hydroxyformamide
Type:
Small organic molecule
Emp. Form.:
C19H25N3O4
Mol. Mass.:
359.4195
SMILES:
CCCC[C@H](CN(O)C=O)C(=O)N1CCC[C@H]1c1nc2ccccc2o1
: