Target
Beta-secretase 1
Ligand
BDBM50254784
Substrate
Meas. Tech.
ChEMBL_560485 (CHEMBL1020505)
IC50
112±n/a nM
Citation
 Chirapu, SRPachaiyappan, BNural, HFCheng, XYuan, HLankin, DCAbdul-Hay, SOThatcher, GRShen, YKozikowski, APPetukhov, PA Molecular modeling, synthesis, and activity studies of novel biaryl and fused-ring BACE1 inhibitors. Bioorg Med Chem Lett 19:264-74 (2008)  
Target
Name:
Beta-secretase 1
Synonyms:
ASP2 Aspartyl protease 2 BACE1 Beta-secretase (BACE) Beta-secretase 1 (BACE 1) Beta-secretase 1 (BACE1) Beta-site amyloid precursor protein cleaving enzyme 1 Memapsin-2 beta-Secretase (BACE-1) | beta-Secretase (BACE1)
Type:
Protein
Mol. Mass.:
55755.10
Organism:
Homo sapiens (Human)
Description:
P56817
Residue:
501
  
Inhibitor
Name:
BDBM50254784
Synonyms:
CHEMBL517179 | N5-((2S,3R)-4-(cyclopropylamino)-3-hydroxy-1-phenylbutan-2-yl)-N7-((R)-1-phenylethyl)chroman-5,7-dicarboxamide
Type:
Small organic molecule
Emp. Form.:
C32H37N3O4
Mol. Mass.:
527.6539
SMILES:
C[C@@H](NC(=O)c1cc2OCCCc2c(c1)C(=O)N[C@@H](Cc1ccccc1)[C@H](O)CNC1CC1)c1ccccc1
: