Target
Beta-secretase 1
Ligand
BDBM50254712
Substrate
Meas. Tech.
ChEMBL_560485 (CHEMBL1020505)
IC50
158±n/a nM
Citation
 Chirapu, SRPachaiyappan, BNural, HFCheng, XYuan, HLankin, DCAbdul-Hay, SOThatcher, GRShen, YKozikowski, APPetukhov, PA Molecular modeling, synthesis, and activity studies of novel biaryl and fused-ring BACE1 inhibitors. Bioorg Med Chem Lett 19:264-74 (2008)  
Target
Name:
Beta-secretase 1
Synonyms:
ASP2 Aspartyl protease 2 BACE1 Beta-secretase (BACE) Beta-secretase 1 (BACE 1) Beta-secretase 1 (BACE1) Beta-site amyloid precursor protein cleaving enzyme 1 Memapsin-2 beta-Secretase (BACE-1) | beta-Secretase (BACE1)
Type:
Protein
Mol. Mass.:
55755.10
Organism:
Homo sapiens (Human)
Description:
P56817
Residue:
501
  
Inhibitor
Name:
BDBM50254712
Synonyms:
CHEMBL499468 | N-((1S,2R)-1-Benzyl-3-cyclopropylamino-2-hydroxy-propyl)-5-(1,1-dioxo-1lambda*6*-[1,2]thiazinan-2-yl)-N'-((R)-1-phenyl-ethyl)-isophthalamide
Type:
Small organic molecule
Emp. Form.:
C33H40N4O5S
Mol. Mass.:
604.759
SMILES:
C[C@@H](NC(=O)c1cc(cc(c1)C(=O)N[C@@H](Cc1ccccc1)[C@H](O)CNC1CC1)N1CCCCS1(=O)=O)c1ccccc1
: