Target
Cytochrome P450 2C19
Ligand
BDBM50254759
Substrate
Meas. Tech.
ChEMBL_558481 (CHEMBL963887)
IC50
8000±n/a nM
Citation
 Barnett, HACoe, DMCooper, TWJack, TIJones, HTMacdonald, SJMcLay, IMRayner, NSasse, RZShipley, TJSkone, PASomers, GITaylor, SUings, IJWoolven, JMWeingarten, GG Aryl aminopyrazole benzamides as oral non-steroidal selective glucocorticoid receptor agonists. Bioorg Med Chem Lett 19:158-62 (2008)  
Target
Name:
Cytochrome P450 2C19
Synonyms:
(R)-limonene 6-monooxygenase (S)-limonene 7-monooxygenase CYP2C19 CYPIIC19 Cytochrome P450 2C19 [I331V] Cytochrome P450-254C Mephenytoin 4-hydroxylase P450-254C
Type:
Enzyme
Mol. Mass.:
55935.47
Organism:
Homo sapiens (Human)
Description:
P33261
Residue:
490
  
Inhibitor
Name:
BDBM50254759
Synonyms:
(+/-)-5-amino-N-(2-((2,6-difluoro-N-(2-fluoroethyl)benzamido)methyl)-3,3,3-trifluoro-2-hydroxypropyl)-1-(4-fluorophenyl)-1H-pyrazole-4-carboxamide | CHEMBL464245
Type:
Small organic molecule
Emp. Form.:
C23H20F7N5O3
Mol. Mass.:
547.4254
SMILES:
Nc1c(cnn1-c1ccc(F)cc1)C(=O)NCC(O)(CN(CCF)C(=O)c1c(F)cccc1F)C(F)(F)F
: