Target
Cytochrome P450 2C19
Ligand
BDBM50254761
Substrate
Meas. Tech.
ChEMBL_558481 (CHEMBL963887)
IC50
20000±n/a nM
Citation
 Barnett, HACoe, DMCooper, TWJack, TIJones, HTMacdonald, SJMcLay, IMRayner, NSasse, RZShipley, TJSkone, PASomers, GITaylor, SUings, IJWoolven, JMWeingarten, GG Aryl aminopyrazole benzamides as oral non-steroidal selective glucocorticoid receptor agonists. Bioorg Med Chem Lett 19:158-62 (2008)  
Target
Name:
Cytochrome P450 2C19
Synonyms:
(R)-limonene 6-monooxygenase (S)-limonene 7-monooxygenase CYP2C19 CYPIIC19 Cytochrome P450 2C19 [I331V] Cytochrome P450-254C Mephenytoin 4-hydroxylase P450-254C
Type:
Enzyme
Mol. Mass.:
55935.47
Organism:
Homo sapiens (Human)
Description:
P33261
Residue:
490
  
Inhibitor
Name:
BDBM50254761
Synonyms:
5-amino-N-(2-((2,6-dichloro-N-(2-hydroxyethyl)benzamido)methyl)-3,3,3-trifluoro-2-hydroxypropyl)-1-(4-fluorophenyl)-1H-pyrazole-4-carboxamide | CHEMBL465451
Type:
Small organic molecule
Emp. Form.:
C23H21Cl2F4N5O4
Mol. Mass.:
578.344
SMILES:
Nc1c(cnn1-c1ccc(F)cc1)C(=O)NCC(O)(CN(CCO)C(=O)c1c(Cl)cccc1Cl)C(F)(F)F
: