Target
Cytochrome P450 2C9
Ligand
BDBM50254466
Substrate
Meas. Tech.
ChEMBL_558482 (CHEMBL963888)
IC50
800±n/a nM
Citation
 Barnett, HACoe, DMCooper, TWJack, TIJones, HTMacdonald, SJMcLay, IMRayner, NSasse, RZShipley, TJSkone, PASomers, GITaylor, SUings, IJWoolven, JMWeingarten, GG Aryl aminopyrazole benzamides as oral non-steroidal selective glucocorticoid receptor agonists. Bioorg Med Chem Lett 19:158-62 (2008)  
Target
Name:
Cytochrome P450 2C9
Synonyms:
(R)-limonene 6-monooxygenase CP2C9_HUMAN CYP2C9 Cytochrome P450 2C9 (CYP2C9 ) P-450MP P450 PB-1 | S-mephenytoin 4-hydroxylase
Type:
Enzyme
Mol. Mass.:
55636.33
Organism:
Homo sapiens (Human)
Description:
P11712
Residue:
490
  
Inhibitor
Name:
BDBM50254466
Synonyms:
5-amino-N-(2-((2,6-dichloro-N-ethylbenzamido)methyl)-3,3,3-trifluoro-2-hydroxypropyl)-1-(4-fluorophenyl)-1H-pyrazole-4-carboxamide | CHEMBL461012
Type:
Small organic molecule
Emp. Form.:
C23H21Cl2F4N5O3
Mol. Mass.:
562.344
SMILES:
CCN(CC(O)(CNC(=O)c1cnn(c1N)-c1ccc(F)cc1)C(F)(F)F)C(=O)c1c(Cl)cccc1Cl
: