Target
Cytochrome P450 2C9
Ligand
BDBM50254679
Substrate
Meas. Tech.
ChEMBL_558482 (CHEMBL963888)
IC50
14000±n/a nM
Citation
 Barnett, HACoe, DMCooper, TWJack, TIJones, HTMacdonald, SJMcLay, IMRayner, NSasse, RZShipley, TJSkone, PASomers, GITaylor, SUings, IJWoolven, JMWeingarten, GG Aryl aminopyrazole benzamides as oral non-steroidal selective glucocorticoid receptor agonists. Bioorg Med Chem Lett 19:158-62 (2008)  
Target
Name:
Cytochrome P450 2C9
Synonyms:
(R)-limonene 6-monooxygenase CP2C9_HUMAN CYP2C9 Cytochrome P450 2C9 (CYP2C9 ) P-450MP P450 PB-1 | S-mephenytoin 4-hydroxylase
Type:
Enzyme
Mol. Mass.:
55636.33
Organism:
Homo sapiens (Human)
Description:
P11712
Residue:
490
  
Inhibitor
Name:
BDBM50254679
Synonyms:
(+/-)-N-(2-((5-amino-1-(4-fluorophenyl)-1H-pyrazole-4-carboxamido)methyl)-3,3,3-trifluoro-2-hydroxypropyl)-3-chloro-N-ethylpicolinamide N-(2-((5-amino-1-(4-fluorophenyl)-1H-pyrazole-4-carboxamido)methyl)-3,3,3-trifluoro-2-hydroxypropyl)-3-chloro-N-ethylpicolinamide
Type:
Small organic molecule
Emp. Form.:
C22H21ClF4N6O3
Mol. Mass.:
528.887
SMILES:
CCN(CC(O)(CNC(=O)c1cnn(c1N)-c1ccc(F)cc1)C(F)(F)F)C(=O)c1ncccc1Cl
: