Target
Cytochrome P450 2C9
Ligand
BDBM50254761
Substrate
Meas. Tech.
ChEMBL_558482 (CHEMBL963888)
IC50
3000±n/a nM
Citation
 Barnett, HACoe, DMCooper, TWJack, TIJones, HTMacdonald, SJMcLay, IMRayner, NSasse, RZShipley, TJSkone, PASomers, GITaylor, SUings, IJWoolven, JMWeingarten, GG Aryl aminopyrazole benzamides as oral non-steroidal selective glucocorticoid receptor agonists. Bioorg Med Chem Lett 19:158-62 (2008)  
Target
Name:
Cytochrome P450 2C9
Synonyms:
(R)-limonene 6-monooxygenase CP2C9_HUMAN CYP2C9 Cytochrome P450 2C9 (CYP2C9 ) P-450MP P450 PB-1 | S-mephenytoin 4-hydroxylase
Type:
Enzyme
Mol. Mass.:
55636.33
Organism:
Homo sapiens (Human)
Description:
P11712
Residue:
490
  
Inhibitor
Name:
BDBM50254761
Synonyms:
5-amino-N-(2-((2,6-dichloro-N-(2-hydroxyethyl)benzamido)methyl)-3,3,3-trifluoro-2-hydroxypropyl)-1-(4-fluorophenyl)-1H-pyrazole-4-carboxamide | CHEMBL465451
Type:
Small organic molecule
Emp. Form.:
C23H21Cl2F4N5O4
Mol. Mass.:
578.344
SMILES:
Nc1c(cnn1-c1ccc(F)cc1)C(=O)NCC(O)(CN(CCO)C(=O)c1c(Cl)cccc1Cl)C(F)(F)F
: