Target
Cytochrome P450 2D6
Ligand
BDBM50254464
Substrate
Meas. Tech.
ChEMBL_558483 (CHEMBL963889)
IC50
27000±n/a nM
Citation
 Barnett, HACoe, DMCooper, TWJack, TIJones, HTMacdonald, SJMcLay, IMRayner, NSasse, RZShipley, TJSkone, PASomers, GITaylor, SUings, IJWoolven, JMWeingarten, GG Aryl aminopyrazole benzamides as oral non-steroidal selective glucocorticoid receptor agonists. Bioorg Med Chem Lett 19:158-62 (2008)  
Target
Name:
Cytochrome P450 2D6
Synonyms:
CP2D6_HUMAN CYP2DL1 Cytochrome P450 2D6 (CYP2D6) P450-DB1
Type:
Protein
Mol. Mass.:
55774.82
Organism:
Homo sapiens (Human)
Description:
P10635
Residue:
497
  
Inhibitor
Name:
BDBM50254464
Synonyms:
(+/-)-5-amino-N-(2-((2-chloro-N-ethylbenzamido)methyl)-3,3,3-trifluoro-2-hydroxypropyl)-1-(4-fluorophenyl)-1H-pyrazole-4-carboxamide CHEMBL517440
Type:
Small organic molecule
Emp. Form.:
C23H22ClF4N5O3
Mol. Mass.:
527.899
SMILES:
CCN(CC(O)(CNC(=O)c1cnn(c1N)-c1ccc(F)cc1)C(F)(F)F)C(=O)c1ccccc1Cl
: