Target
Glucocorticoid receptor
Ligand
BDBM50254759
Substrate
Meas. Tech.
ChEMBL_558475 (CHEMBL963881)
IC50
19.95±n/a nM
Citation
 Barnett, HACoe, DMCooper, TWJack, TIJones, HTMacdonald, SJMcLay, IMRayner, NSasse, RZShipley, TJSkone, PASomers, GITaylor, SUings, IJWoolven, JMWeingarten, GG Aryl aminopyrazole benzamides as oral non-steroidal selective glucocorticoid receptor agonists. Bioorg Med Chem Lett 19:158-62 (2008)  
Target
Name:
Glucocorticoid receptor
Synonyms:
GCR_HUMAN GRL Glucocorticoid receptor (GRFP) Nuclear receptor subfamily 3 group C member 1
Type:
Enzyme
Mol. Mass.:
85656.87
Organism:
Homo sapiens (Human)
Description:
P04150
Residue:
777
  
Inhibitor
Name:
BDBM50254759
Synonyms:
(+/-)-5-amino-N-(2-((2,6-difluoro-N-(2-fluoroethyl)benzamido)methyl)-3,3,3-trifluoro-2-hydroxypropyl)-1-(4-fluorophenyl)-1H-pyrazole-4-carboxamide | CHEMBL464245
Type:
Small organic molecule
Emp. Form.:
C23H20F7N5O3
Mol. Mass.:
547.4254
SMILES:
Nc1c(cnn1-c1ccc(F)cc1)C(=O)NCC(O)(CN(CCF)C(=O)c1c(F)cccc1F)C(F)(F)F
: