Target
Glucocorticoid receptor
Ligand
BDBM50412611
Substrate
Meas. Tech.
ChEMBL_558475 (CHEMBL963881)
IC50
19.95±n/a nM
Citation
 Barnett, HACoe, DMCooper, TWJack, TIJones, HTMacdonald, SJMcLay, IMRayner, NSasse, RZShipley, TJSkone, PASomers, GITaylor, SUings, IJWoolven, JMWeingarten, GG Aryl aminopyrazole benzamides as oral non-steroidal selective glucocorticoid receptor agonists. Bioorg Med Chem Lett 19:158-62 (2008)  
Target
Name:
Glucocorticoid receptor
Synonyms:
GCR_HUMAN GRL Glucocorticoid receptor (GRFP) Nuclear receptor subfamily 3 group C member 1
Type:
Enzyme
Mol. Mass.:
85656.87
Organism:
Homo sapiens (Human)
Description:
P04150
Residue:
777
  
Inhibitor
Name:
BDBM50412611
Synonyms:
CHEMBL479431
Type:
Small organic molecule
Emp. Form.:
C23H21ClF5N5O3
Mol. Mass.:
545.89
SMILES:
CCN(CC(O)(CNC(=O)c1cnn(c1N)-c1ccc(F)cc1)C(F)(F)F)C(=O)c1ccc(F)cc1Cl
: