Target
Bcl2-associated agonist of cell death
Ligand
BDBM50254521
Substrate
Meas. Tech.
ChEMBL_558764 (CHEMBL1019893)
IC50
4110±n/a nM
Citation
 Porter, JPayne, Ade Candole, BFord, DHutchinson, BTrevitt, GTurner, JEdwards, CWatkins, CWhitcombe, IDavis, JStubberfield, C Tetrahydroisoquinoline amide substituted phenyl pyrazoles as selective Bcl-2 inhibitors. Bioorg Med Chem Lett 19:230-3 (2008)  
Target
Name:
Bcl2-associated agonist of cell death
Synonyms:
BAD BBC6 Bcl-2-binding component 6 Bcl-XL/Bcl-2-associated death promoter Bcl2-L-8 | Bcl2-antagonist of cell death (BAD)
Type:
PROTEIN
Mol. Mass.:
18393.69
Organism:
Homo sapiens (Human)
Description:
ChEMBL_478760
Residue:
168
  
Inhibitor
Name:
BDBM50254521
Synonyms:
CHEMBL516633 | N-cyclohexyl-5-methyl-N-phenyl-1-(2-(1,2,3,4-tetrahydroisoquinoline-2-carbonyl)phenyl)-1H-pyrazole-3-carboxamide
Type:
Small organic molecule
Emp. Form.:
C33H34N4O2
Mol. Mass.:
518.6487
SMILES:
Cc1cc(nn1-c1ccccc1C(=O)N1CCc2ccccc2C1)C(=O)N(C1CCCCC1)c1ccccc1
: