Target
Bcl2-associated agonist of cell death
Ligand
BDBM50254526
Substrate
Meas. Tech.
ChEMBL_558764 (CHEMBL1019893)
IC50
9690±n/a nM
Citation
 Porter, JPayne, Ade Candole, BFord, DHutchinson, BTrevitt, GTurner, JEdwards, CWatkins, CWhitcombe, IDavis, JStubberfield, C Tetrahydroisoquinoline amide substituted phenyl pyrazoles as selective Bcl-2 inhibitors. Bioorg Med Chem Lett 19:230-3 (2008)  
Target
Name:
Bcl2-associated agonist of cell death
Synonyms:
BAD BBC6 Bcl-2-binding component 6 Bcl-XL/Bcl-2-associated death promoter Bcl2-L-8 | Bcl2-antagonist of cell death (BAD)
Type:
PROTEIN
Mol. Mass.:
18393.69
Organism:
Homo sapiens (Human)
Description:
ChEMBL_478760
Residue:
168
  
Inhibitor
Name:
BDBM50254526
Synonyms:
1-(2-((S)-3-(acetamidomethyl)-1,2,3,4-tetrahydroisoquinoline-2-carbonyl)phenyl)-5-methyl-N,N-diphenyl-1H-pyrazole-3-carboxamide | CHEMBL510332
Type:
Small organic molecule
Emp. Form.:
C36H33N5O3
Mol. Mass.:
583.6789
SMILES:
CC(=O)NC[C@@H]1Cc2ccccc2CN1C(=O)c1ccccc1-n1nc(cc1C)C(=O)N(c1ccccc1)c1ccccc1
: