Target
Bcl2-associated agonist of cell death
Ligand
BDBM50254582
Substrate
Meas. Tech.
ChEMBL_558764 (CHEMBL1019893)
IC50
5240±n/a nM
Citation
 Porter, JPayne, Ade Candole, BFord, DHutchinson, BTrevitt, GTurner, JEdwards, CWatkins, CWhitcombe, IDavis, JStubberfield, C Tetrahydroisoquinoline amide substituted phenyl pyrazoles as selective Bcl-2 inhibitors. Bioorg Med Chem Lett 19:230-3 (2008)  
Target
Name:
Bcl2-associated agonist of cell death
Synonyms:
BAD BBC6 Bcl-2-binding component 6 Bcl-XL/Bcl-2-associated death promoter Bcl2-L-8 | Bcl2-antagonist of cell death (BAD)
Type:
PROTEIN
Mol. Mass.:
18393.69
Organism:
Homo sapiens (Human)
Description:
ChEMBL_478760
Residue:
168
  
Inhibitor
Name:
BDBM50254582
Synonyms:
5-methyl-1-(2-((R)-3-methyl-1,2,3,4-tetrahydroisoquinoline-2-carbonyl)phenyl)-N,N-diphenyl-1H-pyrazole-3-carboxamide | CHEMBL514298
Type:
Small organic molecule
Emp. Form.:
C34H30N4O2
Mol. Mass.:
526.6276
SMILES:
C[C@@H]1Cc2ccccc2CN1C(=O)c1ccccc1-n1nc(cc1C)C(=O)N(c1ccccc1)c1ccccc1
: