Target
Bcl2-associated agonist of cell death
Ligand
BDBM50254583
Substrate
Meas. Tech.
ChEMBL_558764 (CHEMBL1019893)
IC50
2410±n/a nM
Citation
 Porter, JPayne, Ade Candole, BFord, DHutchinson, BTrevitt, GTurner, JEdwards, CWatkins, CWhitcombe, IDavis, JStubberfield, C Tetrahydroisoquinoline amide substituted phenyl pyrazoles as selective Bcl-2 inhibitors. Bioorg Med Chem Lett 19:230-3 (2008)  
Target
Name:
Bcl2-associated agonist of cell death
Synonyms:
BAD BBC6 Bcl-2-binding component 6 Bcl-XL/Bcl-2-associated death promoter Bcl2-L-8 | Bcl2-antagonist of cell death (BAD)
Type:
PROTEIN
Mol. Mass.:
18393.69
Organism:
Homo sapiens (Human)
Description:
ChEMBL_478760
Residue:
168
  
Inhibitor
Name:
BDBM50254583
Synonyms:
4-bromo-1-(2-((S)-3-(hydroxymethyl)-1,2,3,4-tetrahydroisoquinoline-2-carbonyl)phenyl)-5-methyl-N,N-diphenyl-1H-pyrazole-3-carboxamide | CHEMBL509788
Type:
Small organic molecule
Emp. Form.:
C34H29BrN4O3
Mol. Mass.:
621.523
SMILES:
Cc1c(Br)c(nn1-c1ccccc1C(=O)N1Cc2ccccc2C[C@H]1CO)C(=O)N(c1ccccc1)c1ccccc1
: