Target
Bcl2-associated agonist of cell death
Ligand
BDBM50254594
Substrate
Meas. Tech.
ChEMBL_558766 (CHEMBL1019895)
IC50
5640±n/a nM
Citation
 Porter, JPayne, Ade Candole, BFord, DHutchinson, BTrevitt, GTurner, JEdwards, CWatkins, CWhitcombe, IDavis, JStubberfield, C Tetrahydroisoquinoline amide substituted phenyl pyrazoles as selective Bcl-2 inhibitors. Bioorg Med Chem Lett 19:230-3 (2008)  
Target
Name:
Bcl2-associated agonist of cell death
Synonyms:
BAD BBC6 Bcl-2-binding component 6 Bcl-XL/Bcl-2-associated death promoter Bcl2-L-8 | Bcl2-antagonist of cell death (BAD)
Type:
PROTEIN
Mol. Mass.:
18393.69
Organism:
Homo sapiens (Human)
Description:
ChEMBL_478760
Residue:
168
  
Inhibitor
Name:
BDBM50254594
Synonyms:
2-(4-(3-(dibutylcarbamoyl)-5-methyl-1H-pyrazol-1-yl)-3-(1,2,3,4-tetrahydroisoquinoline-2-carbonyl)phenoxy)acetic acid | CHEMBL473446
Type:
Small organic molecule
Emp. Form.:
C31H38N4O5
Mol. Mass.:
546.6572
SMILES:
CCCCN(CCCC)C(=O)c1cc(C)n(n1)-c1ccc(OCC(O)=O)cc1C(=O)N1CCc2ccccc2C1
: