Target
Bcl2-associated agonist of cell death
Ligand
BDBM50254535
Substrate
Meas. Tech.
ChEMBL_558766 (CHEMBL1019895)
IC50
6160±n/a nM
Citation
 Porter, JPayne, Ade Candole, BFord, DHutchinson, BTrevitt, GTurner, JEdwards, CWatkins, CWhitcombe, IDavis, JStubberfield, C Tetrahydroisoquinoline amide substituted phenyl pyrazoles as selective Bcl-2 inhibitors. Bioorg Med Chem Lett 19:230-3 (2008)  
Target
Name:
Bcl2-associated agonist of cell death
Synonyms:
BAD BBC6 Bcl-2-binding component 6 Bcl-XL/Bcl-2-associated death promoter Bcl2-L-8 | Bcl2-antagonist of cell death (BAD)
Type:
PROTEIN
Mol. Mass.:
18393.69
Organism:
Homo sapiens (Human)
Description:
ChEMBL_478760
Residue:
168
  
Inhibitor
Name:
BDBM50254535
Synonyms:
1-(4-amino-2-((S)-3-(aminomethyl)-1,2,3,4-tetrahydroisoquinoline-2-carbonyl)phenyl)-N,N-dibutyl-4-chloro-5-methyl-1H-pyrazole-3-carboxamide | CHEMBL518649
Type:
Small organic molecule
Emp. Form.:
C30H39ClN6O2
Mol. Mass.:
551.123
SMILES:
CCCCN(CCCC)C(=O)c1nn(c(C)c1Cl)-c1ccc(N)cc1C(=O)N1Cc2ccccc2C[C@H]1CN
: