Target
M-phase inducer phosphatase 2
Ligand
BDBM50267086
Substrate
Meas. Tech.
ChEMBL_565114 (CHEMBL965758)
IC50
80±n/a nM
Citation
 Cao, SMurphy, BTFoster, CLazo, JSKingston, DG Bioactivities of simplified adociaquinone B and naphthoquinone derivatives against Cdc25B, MKP-1, and MKP-3 phosphatases. Bioorg Med Chem 17:2276-81 (2009)  
Target
Name:
M-phase inducer phosphatase 2
Synonyms:
CDC25B Dual specificity phosphatase (CDC25B) M-phase inducer phosphatase 2 (CDC25B) | MPIP2_HUMAN
Type:
Protein
Mol. Mass.:
64985.27
Organism:
Homo sapiens (Human)
Description:
Residue:
580
  
Inhibitor
Name:
BDBM50267086
Synonyms:
Adociaquinone B | CHEMBL476648
Type:
Small organic molecule
Emp. Form.:
C22H17NO6S
Mol. Mass.:
423.438
SMILES:
C[C@@]12CCCc3coc(c13)C(=O)c1cc3C(=O)C4=NCCS(=O)(=O)C4C(=O)c3cc21
: